BDBM50217637 (E)-N-(4-aminobutyl)-2-(1-(4-chlorobenzoyl)-5-methoxy-2-methyl-1H-indol-3-yl)-N-(2-methyl-3-phenylallyl)acetamide::CHEMBL236840
SMILES COc1ccc2n(C(=O)c3ccc(Cl)cc3)c(C)c(CC(=O)N(CCCCN)C\C(C)=C\c3ccccc3)c2c1
InChI Key InChIKey=BXQPDOCYIGQSTK-FCDQGJHFSA-N
Data  4 KI
  Tab Delimited (TSV)   2D SDfile   Computed 3D by Vconf -m prep SDfile
Find this compound or compounds like it in BindingDB:
Activity Spreadsheet -- Enzyme Inhibition Constant Data from BindingDB
Found 1 hit for monomerid = 50217637
TargetMelanocortin receptor 4(Homo sapiens (Human))
Uppsala University
Curated by ChEMBL
LigandPNGBDBM50217637((E)-N-(4-aminobutyl)-2-(1-(4-chlorobenzoyl)-5-meth...)
Affinity DataKi:  7.10E+3nM. Assay description: Displacement of [125I]NDP-MSH from human recombinant MC4 receptor expressed in Sf9 cells
In DepthDetails ArticlePubMed